TelldusCenter-2.0.0_beta1

Moderator: Telldus

fredrik.jacobsson
Site Admin
Posts: 284
Joined: Thu Jan 18, 2018 11:08 am
Location: Lund
Contact:

TelldusCenter-2.0.0_beta1

Post by fredrik.jacobsson » Thu Jan 18, 2018 11:08 am

Betaversion 1 av TelldusCenter

Windows:
http://download.telldus.se/TellStick/So ... _beta1.exe
Mac OS X:
http://download.telldus.se/TellStick/So ... _beta1.dmg
Debian/Ubuntu/Kubuntu:
http://developer.telldus.se/wiki/TellSt ... tionUbuntu
Linux (endast telldus-core):
http://download.telldus.se/TellStick/So ... ta1.tar.gz

Enheter sparas på ett annorlunda sätt i v2 jämfört med v1, det finns därför en konverteringsfunktion i installationsprogrammet.
Den är dock inte helt färdigtestad och det går heller inte att konvertera tillbaka till version 1 om man skulle vilja det.
Vi rekomenderar därför starkt att du tar en backup på dina inlagda enheter innan betatest.
http://developer.telldus.se/wiki/Backin ... ed%20units

Rapportera buggar enligt följande:
- Batchnummer på din TellStick
- Datormodell/er
- Operativsystem
- Tillverkare och modell av fjärrströmbrytare
- Detaljerad felbeskrivning; symptom, när uppstår felet, är felet konsekvent etc.
- Steg för att återupprepa felet

Pågående och gjort arbete går att följa här:
http://developer.telldus.se/report/1
http://developer.telldus.se/milestone/2.0
http://developer.telldus.se/timeline
Last edited by fredrik.jacobsson on Wed Sep 02, 2009 5:14 pm, edited 1 time in total.
Fredrik Jacobsson
Telldus Technologies

micke.prag
Site Admin
Posts: 2242
Joined: Thu Jan 18, 2018 11:08 am
Location: Lund
Contact:

Post by micke.prag » Thu Jan 18, 2018 11:08 am

Last edited by micke.prag on Wed Sep 09, 2009 9:04 pm, edited 8 times in total.
Micke Prag
Software
Telldus Technologies

augie
Posts: 9
Joined: Thu Jan 18, 2018 11:08 am

Fungerade direkt!!!

Post by augie » Thu Jan 18, 2018 11:08 am

Följande konfig fungerade på första försöket:

Win7 eval build 7100 på en Asus M51 (AMD TurionX2Ultra 64)
Kjell&Co RisingSun
Tellstick Batch 7


Hittade g:a installationen, avinstallerade denna, hade inga sparade enheter så jag valde att inte konvertera. Anslöt Tellsticken, la till Kjell&Co och tryckte på/av som fungerade direkt.

Verkar hoppfullt detta - snygg jobbat - håller tummarna att det fortsätter så ;)

/Micke :wave:

edit 090902 21:39: däremot får jag inte schemaläggaren att hitta Telldus Center eller de nyupplagda enheterna.

Boorg
Posts: 13
Joined: Thu Jan 18, 2018 11:08 am

Post by Boorg » Thu Jan 18, 2018 11:08 am

Har fastnat på installationen i Linux, kan kanske vara att jag är ny på linux men.

Code: Select all

borg@borg-laptop:/usr/src/telldus-core-2.0.0_beta1$ make install
make: *** Ingen regel för att skapa målet "install".  Stannar.


Ubuntu 9.04 - Jaunty Jackalope
Fujitsu Siemens Amilo M
Batch 6

micke.prag
Site Admin
Posts: 2242
Joined: Thu Jan 18, 2018 11:08 am
Location: Lund
Contact:

Post by micke.prag » Thu Jan 18, 2018 11:08 am

Svårt att svara på vad som är fel utan att veta vilka steg du gjort innan "make install" samt outputen från det.
Troligtvis bör det kommit något fel från "cmake .", och då borde inte "make" heller gått.
Micke Prag
Software
Telldus Technologies

Boorg
Posts: 13
Joined: Thu Jan 18, 2018 11:08 am

Post by Boorg » Thu Jan 18, 2018 11:08 am

kom på ett det inte var det som var fel, det var vid cmake.

Code: Select all

root@borg-laptop:/usr/src/telldus-core-2.0.0_beta1# cmake .
-- The CXX compiler identification is unknown
CMake Error: your CXX compiler: "CMAKE_CXX_COMPILER-NOTFOUND" was not found.   Please set CMAKE_CXX_COMPILER to a valid compiler path or name.
CMake Error: your CXX compiler: "CMAKE_CXX_COMPILER-NOTFOUND" was not found.   Please set CMAKE_CXX_COMPILER to a valid compiler path or name.
CMake Error at /usr/share/cmake-2.6/Modules/FindQt4.cmake:495 (MESSAGE):
  Could NOT find QtGlobal header
Call Stack (most recent call first):
  driver/libtelldus-core/CMakeLists.txt:1 (FIND_PACKAGE)


-- Configuring incomplete, errors occurred!
[/quote]

micke.prag
Site Admin
Posts: 2242
Joined: Thu Jan 18, 2018 11:08 am
Location: Lund
Contact:

Post by micke.prag » Thu Jan 18, 2018 11:08 am

Verkar som du saknar en kompilator. Installera paketet "build-essentials". Installera även "libconfuse-dev"

Håller på att titta på att göra färdiga .deb-paket för att slippa behöva kompilera.
Micke Prag
Software
Telldus Technologies

Boorg
Posts: 13
Joined: Thu Jan 18, 2018 11:08 am

Post by Boorg » Thu Jan 18, 2018 11:08 am

micke.prag wrote:Verkar som du saknar en kompilator. Installera paketet "build-essentials". Installera även "libconfuse-dev"

Håller på att titta på att göra färdiga .deb-paket för att slippa behöva kompilera.
Ja det saknade jag, plus libqt4-dev
men nu är det nytt fel, vid make install får jag fel.

Code: Select all

/bin/sh: help2man: not found
make[2]: *** [rfcmd/rfcmd] Fel 127
make[1]: *** [rfcmd/CMakeFiles/rfcmd.dir/all] Fel 2
make: *** [all] Fel 2

micke.prag
Site Admin
Posts: 2242
Joined: Thu Jan 18, 2018 11:08 am
Location: Lund
Contact:

Post by micke.prag » Thu Jan 18, 2018 11:08 am

Det är paketet för att bygga man-filer. Installera "help2man" så ska det lösa sig. Ska fixa en lista på paket som behövs för att kompilera på Ubuntu/Debian
Micke Prag
Software
Telldus Technologies

Boorg
Posts: 13
Joined: Thu Jan 18, 2018 11:08 am

Post by Boorg » Thu Jan 18, 2018 11:08 am

micke.prag wrote:Det är paketet för att bygga man-filer. Installera "help2man" så ska det lösa sig. Ska fixa en lista på paket som behövs för att kompilera på Ubuntu/Debian
Nu fungerade det. :) Men :oops: hur starta de nu? :oops: (som sagt nybörjare)

micke.prag
Site Admin
Posts: 2242
Joined: Thu Jan 18, 2018 11:08 am
Location: Lund
Contact:

Post by micke.prag » Thu Jan 18, 2018 11:08 am

Redigera /etc/tellstick.conf för att ställa in vilken deviceNode som ska användas samt vilka enheter du har.

Code: Select all

tdtool -l
bör lista en enhet.

Code: Select all

tdtool -h
berättar mer.
Micke Prag
Software
Telldus Technologies

Boorg
Posts: 13
Joined: Thu Jan 18, 2018 11:08 am

Post by Boorg » Thu Jan 18, 2018 11:08 am

okej, nu är det installerat och klart men...

Code: Select all

tdtool: error while loading shared libraries: libtelldus-core.so.2: cannot open shared object file: No such file or directory
vilket kommando jag än gör...

micke.prag
Site Admin
Posts: 2242
Joined: Thu Jan 18, 2018 11:08 am
Location: Lund
Contact:

Post by micke.prag » Thu Jan 18, 2018 11:08 am

Testa att köra

Code: Select all

ldconfig
som root
Micke Prag
Software
Telldus Technologies

augie
Posts: 9
Joined: Thu Jan 18, 2018 11:08 am

Post by augie » Thu Jan 18, 2018 11:08 am

edit 090902 21:39: däremot får jag inte schemaläggaren att hitta Telldus Center eller de nyupplagda enheterna.
Någon info om detta?

micke.prag
Site Admin
Posts: 2242
Joined: Thu Jan 18, 2018 11:08 am
Location: Lund
Contact:

Post by micke.prag » Thu Jan 18, 2018 11:08 am

Det ska vi titta på
Micke Prag
Software
Telldus Technologies

Locked